{"text_format":"1","workbook":"xlsx","n_sheets":4,"sheets":["Data Sheet","Data","Fluid Table","Conversions"],"not_rendered":{"charts":0,"images":2,"macros":1,"external_links":2,"defined_names":208,"comments":0,"pivot_tables":0},"unopened":[],"bounds":{"document_bytes":16777216,"sheet_cells":100000,"rows_first":2000,"rows_last":500,"rows_between":2000,"halvings":0,"cell_chars":16384,"cell_head_chars":4096},"cells_cut":0,"cells_raw":0,"read":"whole","date_system":"1900"}

{"sheet":"Data Sheet","index":0,"n_rows":116,"n_cols":9,"rows_kept":116,"cut":false,"hidden":false,"merged":[[115,1,115,6],[84,2,84,3],[85,2,85,3],[86,2,86,3],[87,2,87,3],[84,5,84,6],[85,5,85,6],[86,5,86,6],[87,5,87,6],[112,5,112,6],[99,5,99,6],[100,5,100,6],[101,5,101,6],[102,5,102,6],[89,2,89,3],[94,2,94,3],[95,2,95,3],[90,2,90,3],[93,2,93,3],[92,2,92,3],[91,2,91,3],[101,2,101,3],[100,2,100,3],[96,2,96,3],[97,2,97,3],[113,5,113,6],[110,5,110,6],[111,5,111,6],[82,2,83,3],[82,4,83,4],[82,7,83,7],[88,5,88,6],[89,5,89,6],[90,5,90,6],[91,5,91,6],[92,5,92,6],[93,5,93,6],[103,5,103,6],[104,5,104,6],[105,5,105,6],[106,5,106,6],[107,5,107,6],[108,5,108,6],[109,5,109,6],[94,5,94,6],[95,5,95,6],[96,5,96,6],[97,5,97,6],[98,5,98,6],[43,20,43,21],[43,15,43,16],[52,23,52,24],[50,6,50,7],[31,1,31,2],[31,6,31,7],[33,1,33,2],[79,6,79,7],[73,6,73,7],[74,1,74,2],[75,1,75,2],[75,6,75,7],[76,6,76,7],[77,6,77,7],[78,6,78,7],[76,1,76,2],[77,1,77,2],[78,1,78,2],[77,3,77,5],[78,3,78,5],[77,22,77,24],[78,22,78,24],[82,22,82,24],[7,1,7,4],[8,1,8,4],[9,1,9,4],[10,1,10,4],[11,1,11,4],[12,1,12,4],[13,1,13,4],[14,1,14,4],[15,1,15,4],[2,1,2,5],[54,18,54,19],[36,1,36,2],[36,6,36,7],[37,1,37,2],[41,1,41,2],[43,1,43,2],[41,6,41,7],[42,1,42,2],[42,6,42,7],[43,6,43,7],[32,6,32,7],[34,13,34,14],[49,18,49,19],[44,15,44,16],[10,14,10,15],[10,19,10,20],[11,14,11,15],[11,19,11,20],[12,14,12,15],[12,19,12,20],[26,1,26,4],[29,1,29,2],[29,6,29,7],[81,18,81,19],[80,22,80,24],[81,22,81,24],[51,6,51,7],[54,1,54,2],[54,6,54,7],[55,1,55,2],[55,6,55,7],[56,1,56,2],[57,1,57,2],[56,6,56,7],[61,1,61,2],[64,1,64,2],[65,1,65,2],[53,23,53,24],[78,18,78,19],[79,22,79,24],[54,23,54,24],[53,18,53,19],[52,18,52,19],[49,23,49,24],[46,23,46,24],[47,18,47,19],[47,23,47,24],[48,23,48,24],[51,23,51,24],[50,18,50,19],[51,18,51,19],[50,23,50,24],[48,18,48,19],[113,2,113,3],[73,1,73,2],[69,17,69,19],[70,17,70,19],[71,17,71,19],[72,17,72,19],[112,2,112,3],[110,2,110,3],[111,2,111,3],[107,2,107,3],[108,2,108,3],[109,2,109,3],[102,2,102,3],[103,2,103,3],[104,2,104,3],[105,2,105,3],[106,2,106,3],[79,1,79,2],[79,18,79,19],[80,18,80,19],[69,3,69,5],[98,2,98,3],[99,2,99,3],[88,2,88,3],[82,18,82,19],[82,8,83,8],[82,1,83,1],[79,8,79,10],[73,8,73,10],[22,1,22,4],[24,1,24,4],[25,1,25,4],[23,1,23,4],[69,1,69,2],[70,1,70,2],[70,6,70,7],[58,1,58,2],[58,6,58,7],[53,1,53,2],[46,18,46,19],[60,6,60,7],[61,6,61,7],[77,18,77,19],[39,3,39,4],[46,1,46,2],[47,1,47,2],[48,1,48,2],[82,5,83,6],[16,1,16,4],[17,1,17,4],[18,1,18,4],[19,1,19,4],[20,1,20,4],[21,1,21,4],[64,6,64,7],[68,1,68,2],[68,6,68,7],[30,1,30,2],[30,6,30,7],[32,1,32,2],[59,1,59,9],[33,6,33,7],[60,1,60,2],[49,1,49,2],[50,1,50,2],[57,6,57,7],[53,6,53,7],[49,6,49,7],[46,6,46,7],[47,6,47,7],[48,6,48,7]]}
[]
[]
[]
[]
[null,"Thermon DATA SHEET May 23, 2013 Version 2.0 Rev 1"]
[]
["(a)","PROJECT DATA"]
[null,null,null,null,null,"<- Customer"]
[null,null,null,null,null,"<- Project Name"]
[null,null,null,null,null,"<- Contact Name"]
[null,null,null,null,null,"<- Contact Telephone #"]
[null,null,null,null,null,"<- Contact e-mail"]
[null,null,null,null,null,"<- Customer Reference #"]
[null,null,null,null,null,"<- Quotation Number"]
[null,null,null,null,null,"<- Quote Due Date"]
[null,null,null,null,null,"<- Budgetary or Firm"]
[null,null,null,null,null,"<- What is Destination Area"]
[null,null,null,null,null,{"$f":"IF(B17=Data!E5,\"<- What Province/Territory\",IF(B17=Data!E6,\"<- What State\",\"<- What is the Country\"))","v":"<- What is the Country"}]
[null,null,null,null,null,"<- Code of Construction"]
[null,null,null,null,null,"<- Delivery Date"]
[null,null,null,null,null,"<- INCO Shipping Term"]
[null,null,null,null,null,"<- Description of Shipping"]
[null,null,null,null,null,"<- Price Validity (days)"]
[null,null,null,null,null,"<- Unit of Measure"]
[null,null,null,null,null,"<- Tag No"]
[null,null,null,null,null,"<- Qty"]
[null,null,null,null,null,"<- Fluid Condition"]
[]
["(b)","PROCESS DATA"]
[null,null,null,"<- Process Fluid",null,null,null,null,"<- Flow Rate"]
[null,null,null,"<- Temp, Op",null,null,null,null,"<- Temp, Design"]
[null,null,null,"<- Temp, Op Min",null,null,null,null,"<- Temp, Design Min"]
[null,null,null,"<- Pressure, Op",null,null,null,null,"<- Pressure, Design"]
[null,null,null,"<- Pressure, Op Min",null,null,null,null,"<- Pressure, Design Min"]
[]
["(c)"]
[null,null,null,"<- Particle Size",null,null,null,null,"<- Efficency"]
[null,null,null,{"$f":"IF(G37=\"Nominal\",\"<- Efficency %\",\"\")","v":""}]
[]
["(d)","FLUID PROPERTIES"]
{"$rows_left_out":77}
{"sheet":"Data","index":1,"n_rows":246,"n_cols":33,"rows_kept":246,"cut":false,"hidden":true,"merged":[]}
[]
[]
[]
[null,"Table:DestinationState","Table:DestinationProvience","Table:DestinationCountry","Table: DestinationArea","Table:CodeofFab",null,"Table:ShippingTerm"]
[null,"Alabama "," Alberta","Afghanistan","Canada","ASME Sect. VIII, Div.1",null,"CFR","COST AND FREIGHT"]
[null,"Alaska"," British Columbia","Albania","USA","ASME Sect. VIII, Div.1+BPE-2007",null,"CIF","COST, INSURANCE AND FREIGHT"]
[null,"Arizona"," Manitoba","Algeria","International","ASME Sect. III, Sub NB (Class 1)",null,"CIP","CARRIAGE AND INSURANCE PAID TO"]
[null,"Arkansas"," New Brunswick","American Samoa",null,"ASME Sect. III, Sub NC (Class 2)",null,"CPT","CARRIAGE PAID TO"]
[null,"California"," Newfoundland and Labrador","Andorra",null,"ASME Sect. III, Sub ND (Class 3)",null,"DAF","DELIVERED AT FRONTIER"]
[null,"Colorado"," Northwest Territories","Angola",null,"ASME B31.1",null,"DDP","DELIVERED DUTY PAID"]
[null,"Connecticut"," Nova Scotia","Anguilla",null,"ASME B31.3",null,"DDU","DELIVERED DUTY UNPAID"]
[null,"Delaware"," Nunavut","Antarctica",null,"CSA N285.0 CL-1 (SEC III CL-1)",null,"DEQ","DELIVERED EX QUAY"]
[null,"Florida"," Ontario","Antigua and Barbuda",null,"CSA N285.0 CL-2 (SEC III CL-2)",null,"DES","DELIVERED EX SHIP"]
[null,"Georgia"," Prince Edward Island","Argentina",null,"CSA N285.0 CL-3 (SEC III CL-3)",null,"EXW","EX WORKS"]
[null,"Hawaii"," Quebec","Armenia",null,"Non-Code",null,"FAS","FREE ALONGSIDE SHIP"]
[null,"Idaho"," Saskatchewan","Aruba",null,null,null,"FCA","FREE CARRIER"]
[null,"Illinois"," Yukon","Bahamas",null,null,null,"FOB","FREE ON BOARD"]
[null,"Indiana",null,"Bahrain"]
[null,"Iowa",null,"Bangladesh"]
[null,"Kansas",null,"Barbados"]
[null,"Kentucky",null,"Belarus"]
[null,"Louisiana",null,"Belgium",null,"Table:UnitsFlowRate",null,"Table:CalcFlowRate",null,null,"Table:UnitsTemp"]
[null,"Maine",null,"Belize",null,"gallon/min",null,"Ref","Value",null,"ºF"]
[null,"Maryland",null,"Benin, Republic of",null,"foot3/h",null,"BPD",2.9163000000000001E-2,null,"ºC"]
[null,"Massachusetts",null,"Bermuda",null,"liter/h",null,"foot3/h",0.1246753,null,"ºK"]
[null,"Michigan",null,"Bhutan",null,"liter/min",null,"foot3/min",7.4805190000000001,null,"ºR"]
[null,"Minnesota",null,"Bolivia",null,"foot3/min",null,"foot3/sec",448.83120000000002]
[null,"Mississippi",null,"Bosnia and Herzegovina",null,"foot3/sec",null,"gallon/day",6.9444440000000004E-4]
[null,"Missouri",null,"Botswana",null,"gallon/day",null,"gallon/h",1.6666670000000001E-2,null,"Table:CalcTempOP",null,null,"Table:CalcTempDesign"]
[null,"Montana",null,"Brazil",null,"gallon/h",null,"gallon/min",1,null,"Ref","Value",null,"Ref","Value"]
[null,"Nebraska",null,"British Virgin Islands",null,"gallon/sec",null,"gallon/sec",60,null,"ºC",{"$f":"'Data Sheet'!B31*(9/5)+32","v":32},null,"ºC",{"$f":"'Data Sheet'!G31*(9/5)+32","v":32}]
[null,"Nevada",null,"Brunei",null,"liter/sec",null,"liter/h",4.4028679999999999E-3,null,"ºF",{"$f":"'Data Sheet'!B31","v":0},null,"ºF",{"$f":"'Data Sheet'!G31","v":0}]
[null,"New Hampshire",null,"Bulgaria",null,"m3/day",null,"liter/min",0.26417210000000002,null,"ºK",{"$f":"('Data Sheet'!B31-273)*(9/5)+32","v":-459.40000000000003},null,"ºK",{"$f":"('Data Sheet'!G31-273)*(9/5)+32","v":-459.40000000000003}]
[null,"New Jersey",null,"Burkina Faso",null,"m3/h",null,"liter/sec",15.85032,null,"ºR",{"$f":"'Data Sheet'!B31- 459.67","v":-459.67},null,"ºR",{"$f":"'Data Sheet'!G31- 459.67","v":-459.67}]
[null,"New Mexico",null,"Burundi",null,"m3/min",null,"m3/day",0.1834528]
[null,"New York",null,"Cambodia",null,"m3/sec",null,"m3/h",4.4028679999999998,null,"Table:CalcTempOPMin",null,null,"Table:CalcTempDesignMin"]
[null,"North Carolina",null,"Cameroon",null,"BPD",null,"m3/min",264.1721,null,"Ref","Value",null,"Ref","Value"]
[null,"North Dakota",null,"Canada",null,"MMSCFD@14.7psi@60°F",null,"m3/sec",15850.32,null,"ºC",{"$f":"'Data Sheet'!B32*(9/5)+32","v":32},null,"ºC",{"$f":"'Data Sheet'!G32*(9/5)+32","v":32}]
[null,"Ohio",null,"Cape Verde Islands",null,"Sm3/h",null,"MMSCFD@14.7psi@60°F",0,null,"ºF",{"$f":"'Data Sheet'!B32","v":0},null,"ºF",{"$f":"'Data Sheet'!G32","v":0}]
[null,"Oklahoma",null,"Cayman Islands",null,"Nm3/h",null,"Sm3/h",0,null,"ºK",{"$f":"('Data Sheet'!B32-273)*(9/5)+32","v":-459.40000000000003},null,"ºK",{"$f":"('Data Sheet'!G32-273)*(9/5)+32","v":-459.40000000000003}]
{"$rows_left_out":207}
{"sheet":"Fluid Table","index":2,"n_rows":330,"n_cols":41,"rows_kept":330,"cut":false,"hidden":true,"merged":[]}
[]
[null,null,null,"Ref",null,"Value"]
[null,null,null,"Temperature",null,"Density"]
[null,null,null,"- t -",null,"- ρ -"]
[null,null,"Description","(oC)","(Lb/ft3)","(kg/m3)","Cst","CSR","Matl Std","302 SS","304 ss","316 SS","440 SS","Aluminum","Titanium","Hastalloy C","Cast Bronze","Brass","Cast Iron ","Carbon Steel","Kynar","PVC","Typan","Teflon","Naryl","Polyacetal","Nylon","ABS","Polyethylene","Polypropylene (PP)","Rylon","Carbon ","Ceramic","Ceramagnet A","Viton","Buna N","Silicon","Neopprene","ethylene Prophylene","Rubber","Epoxy"]
[null,null,1,2,3,4,5,6,7,8,9,10,11,12,13,14,15,16,17,18,19,20]
[null,null,"Acetamide ",20,{"$f":"F7*0.0624279606","v":72.416434296000006},1160,null,0,316,"-","B","A","-","-","A","A","D","-","-","C","-","D","D","A","-","A","A","D","C","B","A","A","A","-","D","B","B","D","B","C","A"]
[null,null,"Acetate Solv. ",null,{"$f":"F8*0.0624279606","v":65.486930669399996},1049,null,0,"Steel","A","B","A","B","B","-","-","-","-","-","C","-","-","-","-","-","B","-","-","-","-","-","-","A","-","A","A","-","A","A","D","A"]
[null,null,"Acetic Acid",25,65.486930669399996,1049,1.232,0,316,"-","B","A","B","B","-","-","A","C","B","A","-","B","D","A","-","-","A","-","B","D","-","A","A","-","D","D","-","D","-","-","A"]
[null,null,"Acetic Anhydride ",null,67.5470533692,1082,0.88,0,304,"B","A","A","B","B","A","A","C","C","D","C","B","A","B","A","A","D","D","C","B","A","A","A","A","-","C","C","-","C","B","C","A"]
[null,null,"Acetone",25,48.979729327548,784.58,0.41,0,"Steel","A","A","A","B","A","A","A","C","D","B","D","D","D","D","A","D","D","D","D","A","A","A","A","A","-","D","A","C","B","B","C","A"]
[null,null,"Acetyl Chloride ",null,68.920468502399999,1104,null,0,316,"-","C","A","-","-","A","A","A","A","A","A","D","D","D","A","D","B","A","D","C","B","A","A","A","A","D","D","B","C","A","D","B"]
[null,null,"Acetylene",null,68.483472778199996,1097,null,0,"Steel","A","A","A","A","A","-","-","D","-","-","-","-","-","-","A","-","-","-","-","-","-","A","-","-","-","A","-","-","-","-","A","A"]
[null,null,"Acrylonitrile ",25,50.566648086000001,810,null,0,304,"A","A","C","-","B","B","-","B","-","A","A","-","B","-","-","-","A","A","-","-","D","A","A","A","-","A","A","C","B","A","C","A"]
[null,null,"Alcohol Amyl ",20,53.188622431200002,852,1.603,0,304,"A","A","A","-","C","B","B","A","-","C","-","-","-","-","-","-","B","-","D","-","B","A","A","A","-","C","D","-","D","D","-","A"]
[null,null,"Alcohol Benzyl ",null,65.174790866400002,1044,null,0,304,"-","A","A","-","B","A","A","A","B","C","C","A","A","B","A","C","A","A","B","B","B","A","A","A","-","A","A","D","A","A","C","A"]
[null,null,"Alcohol Butyl ",20,50.547919697819999,809.7,3.64,0,304,"A","A","A","-","B","A","A","A","C","-","-","-","D","B","-","A","A","A","D","D","A","-","A","A","-","A","D","-","B","B","D","A"]
[null,null,"Alcohol Diacetone",null,58.557427042800001,938,null,0,"Steel","-","A","A","-","A","B","A","B","C","C","C","A","A","B","A","A","A","A","-","B","B","A","A","A","-","A","A","D","A","A","A","A"]
[null,null,"Alcohol Ethyl ",20,48.194385583200003,772,1.51,0,"Steel","-","A","A","A","B","A","A","A","C","-","A","-","D","-","-","A","A","A","-","-","D","-","A","A","-","D","D","-","D","A","D","A"]
[null,null,"Alcohol Hexyl ",null,50.816359928399997,814,null,0,"Steel","-","A","A","-","A","A","A","A","C","A","A","-","A","C","-","A","B","A","B","B","A","-","A","A","A","A","A","B","A","B","A","A"]
[null,null,"Alcohol Isobutyl ",20,50.042253216959999,801.6,null,0,"Steel","-","A","A","-","B","A","A","A","C","-","A","-","-","-","-","A","A","A","-","-","A","-","A","A","-","A","A","D","B","A","A","A"]
[null,null,"Alcohol Isopropyl ",20,49.030920255239998,785.4,null,0,"Steel","-","A","A","-","B","A","A","A","C","-","A","-","-","-","-","A","A","A","B","-","A","-","A","A","-","A","C","B","A","A","A","A"]
[null,null,"Alcohol Methyl",20,49.442944795199999,792,0.745,0,"Steel","-","A","A","A","B","A","A","A","C","C","A","-","-","-","-","A","A","A","-","-","A","-","A","A","-","A","C","C","B","A","A","A"]
[null,null,"Alcohol Octyl ",null,51.440639534399999,824,null,0,"Steel","-","A","A","-","A","A","A","A","C","A","A","-","B","-","A","A","C","A","D","B","A","-","A","A","A","C","B","-","A","A","A","A"]
[null,null,"Alcohol Propyl ",25,49.939871361576003,799.96,null,0,"Steel","-","A","A","-","A","A","A","A","C","-","A","-","-","-","-","A","A","A","-","-","-","-","A","A","-","A","B","-","B","A","C","A"]
[null,null,"Amines ",null,74.913552719999998,1200,null,0,304,"A","A","A","-","A","A","A","A","-","-","A","B","A","-","A","A","A","A","-","-","A","-","A","A","-","A","A","B","A","A","A","A"]
[null,null,"Ammonia (10%) ",null,0,null,null,0,316,"-","-","A","-","-","B","A","B","-","A","B","-","C","A","A","B","D","A","-","-","-","-","A","A","-","D","D","C","B","B","C","A"]
[null,null,"Ammonia, Anhydrous ",15,45.572411238000001,730,null,0,316,"A","B","A","A","B","A","A","-","-","-","-","D","A","-","A","A","-","A","-","-","A","A","-","A","-","A","D","-","A","-","-","B"]
[null,null,"Ammonia, Liquids ",25,51.40006136001,823.35,null,0,"Steel","-","A","A","A","D","B","A","D","-","D","B","D","A","B","A","A","D","A","-","B","A","B","C","A","-","D","B","B","A","A","D","A"]
[null,null,"Amyl Chloride ",null,54.062613879600001,866,null,0,"Steel","-","C","B","-","D","-","B","D","-","A","A","-","A","B","A","A","D","-","-","D","A","-","A","A","-","D","B","B","A","A","D","A"]
[null,null,"Amyl-Acetate ",20,54.686893485599995,876,4.34,0,304,"B","A","A","C","B","-","A","A","-","-","A","A","D","C","A","D","A","C","-","D","D","-","A","A","-","A","D","-","D","D","D","A"]
[null,null,"Aniline ",25,63.609721894157992,1018.93,null,0,304,"B","A","A","A","C","A","A","C","-","-","C","C","D","D","A","D","A","B","-","D","D","A","A","A","-","D","D","D","D","A","D","A"]
[null,null,"Aqua Regia (80% HCl, 20% HNO) ",null,0,null,null,0,"Not Defined","-","D","D","-","D","A","B","C","-","-","C","C","D","D","A","D","D","C","D","C","B","A","A","A","-","C","D","C","D","B","D","A"]
[null,null,"Arochlor 1248 ",null,0,null,null,0,"Steel","-","-","-","-","-","A","D","D","-","-","-","C","D","D","A","D","D","D","-","D","C","-","-","D","-","C","D","C","D","D","D","D"]
[null,null,"Beer",10,63.052240206,1010,1.8,0,304,"A","A","A","-","A","-","-","-","-","-","A","-","-","-","-","D","-","-","-","-","-","-","A","-","-","A","D","-","D","B","D","A"]
[null,null,"Benzaldehyde",25,65.049934945199993,1042,null,0,"Steel","A","A","A","-","B","A","A","A","B","D","D","A","A","-","A","A","B","D","B","B","D","-","A","A","-","A","D","C","A","A","A","A"]
[null,null,"Benzene",25,54.550176251885993,873.81,0.69699999999999995,0,304,"B","A","A","A","B","A","A","A","-","B","A","C","D","D","A","D","A","C","D","D","D","A","A","A","-","D","D","B","D","A","D","A"]
[null,null,"Benzol ",25,67.399723382184007,1079.6400000000001,null,0,304,"-","A","A","-","B","A","B","B","A","B","C","B","D","C","A","D","A","A","D","D","D","A","A","A","A","A","D","-","D","D","D","A"]
[null,null,"Brine",15,76.786391538000004,1230,null,0,"Steel","C","C","C","C","C","A","A","B","A","-","-","-","D","-","A","D","A","A","-","-","A","-","A","A","A","D","D","-","D","-","-","A"]
[null,null,"Bromine (Wet) ",25,194.80020825624001,3120.4,null,0,"Not Defined","D","D","D","D","D","A","A","A","D","D","D","-","B","B","A","A","-","A","-","-","A","-","-","B","-","A","A","B","-","-","A","-"]
{"$rows_left_out":291}
{"sheet":"Conversions","index":3,"n_rows":58,"n_cols":10,"rows_kept":58,"cut":false,"hidden":true,"merged":[[36,1,36,2],[36,6,36,7],[56,1,56,2],[56,6,56,7],[57,1,57,2],[57,6,57,7],[37,1,37,2],[38,1,38,2],[29,1,29,2],[29,6,29,7],[32,1,32,2],[35,3,35,4],[25,1,25,2],[25,6,25,7],[26,1,26,2],[26,6,26,7],[28,1,28,2],[28,6,28,7],[27,1,27,2],[27,6,27,7]]}
[]
[]
[]
[]
[]
[]
[]
[]
[]
[]
[]
[]
[]
[]
[]
[]
[]
[]
[]
[]
[]
[]
[]
[]
["(b)","PROCESS DATA"]
[null,{"$f":"'Data Sheet'!B30:C30","v":0},null,"<- Process Fluid",null,null,{"$f":"ROUND(VLOOKUP('Data Sheet'!J30,CalcFlowRate,2)*'Data Sheet'!G30,2)","v":{"$error":"#N/A"}},null,"<- Flow Rate"]
[null,{"$f":"ROUND(VLOOKUP('Data Sheet'!F31,CalcTempOP,2),2)","v":{"$error":"#N/A"}},null,"<- Temp Op","ºF",null,{"$f":"ROUND(VLOOKUP('Data Sheet'!F31,CalcTempDesign,2),2)","v":{"$error":"#N/A"}},null,"<- Temp Design","ºF"]
[null,{"$f":"ROUND(VLOOKUP('Data Sheet'!F32,CalcTempOPMin,2),2)","v":{"$error":"#N/A"}},null,"<- Temp Op Min","ºF",null,{"$f":"ROUND(VLOOKUP('Data Sheet'!J32,CalcTempDesignMin,2),2)","v":{"$error":"#N/A"}},null,"<- Temp Design Min","ºF"]
[null,{"$f":"ROUND(VLOOKUP('Data Sheet'!F33,CalcPressureOP,2),2)","v":{"$error":"#N/A"}},null,"<- Pressure, Op","PSIG",null,{"$f":"ROUND(VLOOKUP('Data Sheet'!F33,CalcPressureDesign,2),2)","v":{"$error":"#N/A"}},null,"<- Pressure, Design","PSIG"]
[null,{"$f":"ROUND(VLOOKUP('Data Sheet'!F34,CalcPressureOPMin,2),2)","v":{"$error":"#N/A"}},null,"<- Pressure, Op","PSIG",null,{"$f":"ROUND(VLOOKUP('Data Sheet'!F34,CalcPressureDesignMin,2),2)","v":{"$error":"#N/A"}},null,"<- Pressure, Design","PSIG"]
[]
["(c)","PARTICULATE PROPERTIES"]
[null,{"$f":"VLOOKUP('Data Sheet'!F37,Data!K82:L85,2)","v":{"$error":"#N/A"}},null,"<- Particle Size","µ"]
[]
[]
["(d)","FLUID PROPERTIES"]
[null,{"$f":"IF('Data Sheet'!B42=\"\",ROUND(VLOOKUP(B26,'Fluid Table'!C7:I329,3),2),(ROUND(VLOOKUP('Data Sheet'!F42,CalcDensity,2),2)))","v":{"$error":"#N/A"}},null,"<-Density @ OP","Lb / ft3"]
[null,{"$f":"IF('Data Sheet'!B43=\"\",Conversions!B37/62.41,'Data Sheet'!B43)","v":{"$error":"#N/A"}},null,"<- SG"]
[null,{"$f":"VLOOKUP('Data Sheet'!F44,CalcViscosity,2)","v":{"$error":"#N/A"}},null,"<-Viscosity @ OP","cST"]
[]
{"$rows_left_out":18}